{"text_format":"1","workbook":"xlsx","n_sheets":4,"sheets":["【StressCheck】","【Results】","【Data】","list"],"not_rendered":{"charts":1,"images":0,"macros":1,"external_links":0,"defined_names":1,"comments":0,"pivot_tables":0},"unopened":[],"bounds":{"document_bytes":16777216,"sheet_cells":100000,"rows_first":2000,"rows_last":500,"rows_between":2000,"halvings":0,"cell_chars":16384,"cell_head_chars":4096},"cells_cut":0,"cells_raw":0,"read":"whole","date_system":"1900"}

{"sheet":"【StressCheck】","index":0,"n_rows":157,"n_cols":13,"rows_kept":157,"cut":false,"hidden":false,"merged":[[9,6,9,7],[1,1,1,11],[127,4,127,6],[96,7,96,8]]}
[]
[null,"【Stress check sheet】"]
[]
[]
[null,null,"１．Basic Information"]
[]
[null,null,null,"①","Please provide your nationality of origin from the right",null,{"$f":"VLOOKUP($H$7,list!$A$3:$B$7,2,FALSE)","v":"Others"},5]
[]
[]
[]
[]
[null,null,null,"②","Please select your gender from the options on the right",null,{"$f":"VLOOKUP($H$12,list!$C$3:$D$4,2,FALSE)","v":"Male"},1]
[]
[null,null,null,"③","Please select your age group from the options on the right",null,{"$f":"VLOOKUP(H14,list!E3:F11,2,FALSE)","v":"Under 20 years old"},1,null,null,null,null," "]
[]
[null,null,null,"④"," What type of vessel are you currently aboard? ",null,{"$f":"VLOOKUP(H16,list!H3:I18,2,FALSE)","v":"① General cargo ship"},1]
[]
[null,null,null,"⑤","Please select your most recent position onboard  from the right",null,{"$f":"VLOOKUP(H18,list!L3:M20,2,FALSE)","v":"⑫Deck Crew (Deckhand, Deckman, etc.) "},12]
[]
[]
[null,null,"２．Stress Check Applicable to All Occupations（57 items）"]
[null,null,null,null,"Please answer the following questions concerning your job while on board                              by selecting the most applicable option from the right."]
[null,null,null,null,"＜Question about the nature and condition of your work＞"]
[null,null,null,1,"I have an extremely large amount of work to do",null,{"$f":"CHOOSE($H24,4,3,2,1)","v":4},1]
[null,null,null,2," I can't complete work in the required time",null,{"$f":"CHOOSE($H25,4,3,2,1)","v":4},1]
[null,null,null,3," I have to work as hard as I can",null,4,1]
[null,null,null,4,"I have to pay very careful attention",null,4,1]
[null,null,null,5,"My job is difficult in that it requires a high level of knowledge and technical skill",null,4,1]
[null,null,null,6,"I need to be constantly thinking about work throughout the working day",null,4,1]
[null,null,null,7,"My job requires a lot of physical work",null,4,1]
[null,null,null,8,"I can work at my own pace",null,{"$f":"H31","v":1},1]
[null,null,null,9," I can choose how and in what order to do my work",null,{"$f":"H32","v":1},1]
[null,null,null,10,"I can reflect my opinions on workplace policy",null,{"$f":"H33","v":1},1]
[null,null,null,11,"My knowledge and skills are rarely used at work",null,{"$f":"CHOOSE($H34,4,3,2,1)","v":4},1]
[null,null,null,12,"There are differences of opinion within my department",null,{"$f":"CHOOSE($H35,4,3,2,1)","v":4},1]
[null,null,null,13,"My department does not get along well with other departments",null,4,1]
[null,null,null,14,"The atmosphere in my workplace is friendly",null,{"$f":"H37","v":1},1]
[null,null,null,15,"My working environment is poor (e.g. noise, lighting, temperature, ventilation)",null,{"$f":"CHOOSE($H38,4,3,2,1)","v":4},1]
[null,null,null,16,"This job suits me well",null,{"$f":"H39","v":1},1]
[null,null,null,17,"My job is worth doing",null,{"$f":"H40","v":1},1]
[]
[null,null,null,null,"Please answer the following questions concerning your condition over the past month    while on board by selecting the most applicable option from the right."]
[null,null,null,null,"＜Questions Regarding Mental Stress Responses＞"]
[null,null,null,18," I have been very active",null,{"$f":"CHOOSE($H44,4,3,2,1)","v":4},1]
[null,null,null,19,"I have been full of energy",null,{"$f":"CHOOSE($H45,4,3,2,1)","v":4},1]
[null,null,null,20,"I have been lively",null,4,1]
[null,null,null,21,"I have felt angry",null,{"$f":"H47","v":1},1]
[null,null,null,22,"I have been inwardly annoyed or aggravated",null,{"$f":"H48","v":1},1]
[null,null,null,23,"I have felt irritable",null,1,1]
[null,null,null,24,"I have felt extremely tired",null,1,1]
[null,null,null,25,"I have felt exhausted",null,1,1]
[null,null,null,26,"I have felt weary or listless",null,1,1]
[null,null,null,27,"I have felt tense",null,1,1]
[null,null,null,28,"I have felt worried or insecure",null,1,1]
[null,null,null,29," I have felt restless",null,1,1]
[null,null,null,30,"I have been depressed",null,1,1]
[null,null,null,31,"I have thought that doing anything was a hassle",null,1,1]
[null,null,null,32,"I have been unable to concentrate",null,1,1]
[null,null,null,33,"I have felt gloomy",null,1,1]
[null,null,null,34,"I have been unable to handle work",null,1,1]
[null,null,null,35,"I have felt sad",null,1,1]
[]
[null,null,null,null,"＜Questions Regarding Physical Stress Responses (Somatic Complaints)＞"]
[null,null,null,36,"I have felt dizzy",null,{"$f":"H64","v":1},1]
[null,null,null,37,"I have experienced joint pains",null,{"$f":"H65","v":1},1]
[null,null,null,38,"I have experienced headaches",null,1,1]
[null,null,null,39,"I have had a stiff neck and / or shoulders",null,1,1]
[null,null,null,40,"I have had lower back pain",null,1,1]
[null,null,null,41,"I have had eyestrain",null,1,1]
[null,null,null,42," I have experienced heart palpitations or shortness of breath",null,1,1]
[null,null,null,43,"I have experienced stomach and / or intestine problems",null,1,1]
[null,null,null,44,"I have lost my appetite",null,1,1]
[null,null,null,45,"I have experienced diarrhea and / or constipation",null,1,1]
[null,null,null,46,"I haven’t been able to sleep well",null,1,1]
[]
[null,null,null,null,"Please answer the following questions concerning the people around you while on board       by selecting the most applicable option from the right."]
[null,null,null,null,"＜Question about the support situation from those around you＞"]
[null,null,null,null,"How freely can you talk with the following people?  (No.47~49)"]
[null,null,null,47,"Superiors",null,{"$f":"H79","v":1},1]
[null,null,null,48,"Co-workers",null,{"$f":"H80","v":1},1]
[null,null,null,49,"Spouse, family, friends, etc.",null,1,1]
[]
[null,null,null,null,"How reliable are the following people when you are troubled?  (No.50~52)"]
[null,null,null,50,"Superiors",null,{"$f":"H84","v":1},1]
[null,null,null,51,"Co-workers",null,{"$f":"H85","v":1},1]
[null,null,null,52,"Spouse, family, friends, etc.",null,1,1]
[]
[null,null,null,null,"How well will the following people listen to you when you ask for advice on personal matters?  (No.53~55)"]
[null,null,null,53,"Superiors",null,{"$f":"H89","v":1},1]
[null,null,null,54,"Co-workers",null,{"$f":"H90","v":1},1]
[null,null,null,55,"Spouse, family, friends, etc.",null,1,1]
[]
[null,null,null,null,"Please answer the following questions concerning your satisfaction while on board.               by selecting the most applicable option from the right."]
[null,null,null,null,"＜Questions Regarding Satisfaction＞"]
[null,null,null,56,"I am satisfied with my job",null,{"$f":"H95","v":1},1]
[null,null,null,57,"I am satisfied with my family life",null,{"$f":"H96","v":1},1]
[]
[null,null,"3．Stress Check Specific to Seafaring Work（52 items）"]
[null,null,null,null,"We would like to ask a bit more about your work while on board.                                            Please select the most appropriate option from the right."]
[null,null,null,58,"Work that is emotionally burdensome",null,1,{"$f":"G100","v":1}]
[null,null,null,59,"Being asked to meet conflicting demands from multiple people",null,1,{"$f":"G101","v":1}]
[null,null,null,60,"Understanding what your duties and responsibilities are",null,{"$f":"CHOOSE($H102, 4, 3, 2, 1)","v":4},1]
[null,null,null,61,"Opportunities to develop your strengths through work",null,{"$f":"CHOOSE($H103, 4, 3, 2, 1)","v":4},1]
[null,null,null,62,"Receiving a wage that matches my work",null,4,1]
[null,null,null,63," I receive appropriate evaluation from my superiors",null,4,1]
[null,null,null,64,"Fear of losing your job",null,1,{"$f":"G106","v":1}]
[null,null,null,65,"My superiors arrange opportunities for subordinates to develop their skills",null,4,1]
[null,null,null,66,"My superiors respond with integrity",null,4,1]
[null,null,null,67,"If you work hard, you will be praised",null,4,1]
[null,null,null,68,"A workplace where you have the chance to recover from failures",null,4,1]
[]
[null,null,null,null,"We would like to ask more details about your work.                                                                 Please select the most appropriate option from the right."]
[null,null,null,69,"Information from the captain and the company is reliable",null,{"$f":"CHOOSE($H113, 4, 3, 2, 1)","v":4},1]
[null,null,null,70,"When there are changes in the workplace or work, the opinions of the crew are considered",null,4,1]
[null,null,null,71,"A workplace that cherishes each individual's values",null,4,1]
[null,null,null,72,"There is sufficient explanation regarding the results of performance evaluations",null,4,1]
[null,null,null,73,"In the workplace, people in various positions are respected as members of the team",null,4,1]
[null,null,null,74,"Education is provided to inspire motivation and to be beneficial for career development.",null,4,1]
[null,null,null,75,"I cannot enrich my personal life because I am preoccupied with work",null,1,{"$f":"G119","v":1}]
[null,null,null,76,"Gaining energy from work makes my personal life more fulfilling",null,4,1]
{"$rows_left_out":38}
{"sheet":"【Results】","index":1,"n_rows":35,"n_cols":13,"rows_kept":35,"cut":false,"hidden":false,"merged":[[2,5,2,16],[25,2,25,15],[34,8,34,10],[33,19,33,20],[8,13,9,13],[8,18,8,19],[33,8,33,10],[32,17,33,17],[32,19,32,20],[7,5,7,12],[6,2,6,14],[24,2,24,14],[9,5,9,12],[11,3,11,14],[8,4,8,6]]}
[]
[]
[null,null,null,null,null,"【Stress Check Individual Results Report】"]
[]
[]
[null,null,"Your stress check results are as follows:"]
[null,null,"＜Stress Check Results Applicable to All Occupations＞"]
[null,null,null,null,null,"Overall Evaluation"]
[null,null,null,null,"Level"]
[null,null,null,null,null,"The results are displayed in five levels. 　　　　　　　　　　　　　　　　　　　　　　　　　　　The higher the stress and load, the higher the level."]
[]
[null,null,null,"Results by Area"]
[null,null,null,"Work-Related Stress Factor",null,null,null,null,null,"Level"]
[null,null,null,"Psychological and Physical Stress Responses",null,null,null,null,null,"Level"]
[null,null,null,"Support from Others",null,null,null,null,null,"Level"]
[]
[]
[]
[]
[]
[]
[]
[]
[]
[null,null,"＜Stress Check Results Specific to Seafaring Work＞"]
[null,null,"Scores for each field are given on a 4-point scale, where a higher score reflects a better result."]
[null,null,null,null,null,null,null,null,null,null,null,"You"," Pretest "]
[null,null,null,null,null,"Workload and Safety Responsibilities",null,null,null,null,null,null,2.6]
[null,null,null,null,null,"Job Evaluation and Growth Opportunities",null,null,null,null,null,null,3.4]
[null,null,null,null,null,"Workplace Atmosphere and Environment",null,null,null,null,null,null,3.9]
[null,null,null,null,null,"Sense of Achievement and Satisfaction",null,null,null,null,null,null,3.4]
[null,null,null,null,null,"Onboard Living Conditions",null,null,null,null,null,null,3]
[]
[null,null,null,null,null,"全体の結果",null,"スコア","判定"]
[null,null,null,null,null,null,null,null,"やや良好"]

{"sheet":"【Data】","index":2,"n_rows":4,"n_cols":134,"rows_kept":4,"cut":false,"hidden":false,"merged":[[0,114,3,114],[0,115,0,133],[1,115,1,123],[1,124,1,129],[1,130,1,133]]}
["１．Basic Information",null,null,null,null,"２．Stress Check Results Applicable to All Occupations",null,null,null,null,null,null,null,null,null,null,null,null,null,null,null,null,null,null,null,null,null,null,null,null,null,null,null,null,null,null,null,null,null,null,null,null,null,null,null,null,null,null,null,null,null,null,null,null,null,null,null,null,null,null,null,null,"３．Stress Check Results Specific to Seafaring Work",null,null,null,null,null,null,null,null,null,null,null,null,null,null,null,null,null,null,null,null,null,null,null,null,null,null,null,null,null,null,null,null,null,null,null,null,null,null,null,null,null,null,null,null,null,null,null,null,null,null,null,"High-stress individuals","＜Stress Check Results Applicable to All Occupations＞"]
[" Question No.",null,null,null,null," Question No.",null,null,null,null,null,null,null,null,null,null,null,null,null,null,null,null,null,null,null,null,null,null,null,null,null,null,null,null,null,null,null,null,null,null,null,null,null,null,null,null,null,null,null,null,null,null,null,null,null,null,null,null,null,null,null,null," Question No.",null,null,null,null,null,null,null,null,null,null,null,null,null,null,null,null,null,null,null,null,null,null,null,null,null,null,null,null,null,null,null,null,null,null,null,null,null,null,null,null,null,null,null,null,null,null,null,null,null,null,null,null,"Work-Related Stress Factor",null,null,null,null,null,null,null,null,"Psychological and Physical Stress Responses",null,null,null,null,null,"Support from Others"]
["①","②","③","④","⑤",1,2,3,4,5,6,7,8,9,10,11,12,13,14,15,16,17,18,19,20,21,22,23,24,25,26,27,28,29,30,31,32,33,34,35,36,37,38,39,40,41,42,43,44,45,46,47,48,49,50,51,52,53,54,55,56,57,58,59,60,61,62,63,64,65,66,67,68,69,70,71,72,73,74,75,76,77,78,79,80,81,82,83,84,85,86,87,88,89,90,91,92,93,94,95,96,97,98,99,100,101,102,103,104,105,106,107,108,109,null,"1,2,3","4,5,6",7,"12,13,14",15,"8,9,10",11,16,17,"18,19,20","21,22,23","24,25,26","27,28,29","30~35","36~46","47,50,53","48,51,54","49,52,55","56,57"]
["Please provide your nationality of origin from the right","Please select us about your gender  from the right","Please select your age from the options of origin from the right"," What type of vessel are you currently aboard? Please select the appropriate from the right","Please select your most recent position onboard  from the right","I have an extremely large amount of work to do"," I can't complete work in the required time"," I have to work as hard as I can","I have to pay very careful attention","My job is difficult in that it requires a high level of knowledge and technical skill","I need to be constantly thinking about work throughout the working day","My job requires a lot of physical work","I can work at my own pace"," I can choose how and in what order to do my work","I can reflect my opinions on workplace policy","My knowledge and skills are rarely used at work","There are differences of opinion within my department","My department does not get along well with other departments","The atmosphere in my workplace is friendly","My working environment is poor (e.g. noise, lighting, temperature, ventilation)","This job suits me well","My job is worth doing"," I have been very active","I have been full of energy","I have been lively","I have felt angry","I have been inwardly annoyed or aggravated","I have felt irritable","I have felt extremely tired","I have felt exhausted","I have felt weary or listless","I have felt tense","I have felt worried or insecure"," I have felt restless","I have been depressed","I have thought that doing anything was a hassle","I have been unable to concentrate","I have felt gloomy","I have been unable to handle work","I have felt sad","I have felt dizzy","I have experienced joint pains","I have experienced headaches","I have had a stiff neck and / or shoulders","I have had lower back pain","I have had eyestrain"," I have experienced heart palpitations or shortness of breath","I have experienced stomach and / or intestine problems","I have lost my appetite","I have experienced diarrhea and / or constipation","I haven’t been able to sleep well","Superiors","Co-workers","Spouse, family, friends, etc.","Superiors","Co-workers","Spouse, family, friends, etc.","Superiors","Co-workers","Spouse, family, friends, etc.","I am satisfied with my job","I am satisfied with my family life","Work that is emotionally burdensome","Being asked to meet conflicting demands from multiple people","Understanding what your duties and responsibilities are","Opportunities to develop your strengths through work","Receiving a wage that matches my work"," I receive appropriate evaluation from my superiors","Fear of losing your job","My superiors arrange opportunities for subordinates to develop their skills","My superiors respond with integrity","If you work hard, you will be praised","A workplace where you have the chance to recover from failures","Information from the captain and the company is reliable","When there are changes in the workplace or work, the opinions of the crew are considered","A workplace that cherishes each individual's values","There is sufficient explanation regarding the results of performance evaluations","In the workplace, people in various positions are respected as members of the team","Education is provided to inspire motivation and to be beneficial for career development.","I cannot enrich my personal life because I am preoccupied with work","Gaining energy from work makes my personal life more fulfilling","I am being bullied in the workplace (including sexual harassment and power harassment)","In our workplace, we understand and acknowledge each other","When working, I feel invigorated","I feel proud of my work.","Taking care to prevent accidents such as collisions, capsizing, and grounding","Working in an environment that is always close to danger","Paying attention to the management of hazardous cargo","Spending time on paperwork in addition to direct operational duties of the vessel","The operational schedule is demanding (the charterer's schedule leaves no room for flexibility)","Spending several days, weeks, or months in the confined environment of the ship","Spending several days, weeks, or months in an environment that is constantly unstable and noisy","Spending several days, weeks, or months working and living with a limited number of people","Being unable to communicate with other seafarers on board","Not being able to have private time on board","Having no means of communication with family, friends, or partners on land","Being unable to use a mobile phone","Having no opportunity to meet with family or friends on land","Being unable to get more than 7 continuous hours of sleep in a day","Having less than 8 hours of free time in a day","Serving on board with seafarers from different cultural or religious backgrounds ","Changes in daily schedule due to time zone differences","Extreme long working hours during standby in severe cold or heat","Working under time constraints during activities such as entering or leaving port","Not being able to eat more than the prescribed amount of food","Limited menu options for meals","Restrictions on opportunities for alcohol consumption","Restrictions on smoking areas and times","Insufficient opportunities for exercise","Insufficient opportunities to pursue hobbies","Inability to engage in outdoor hobbies","Serving on board with a superior you do not get along with","Serving on board with a subordinate you do not get along with","Limited interaction with a small group of seafarers",null,"Psychological workload (quantity)","Psychological workload (quality)","Perceived physical burden","Interpersonal stress at work","Stress due to workplace environment","Degree of job control","Degree of skill utilization","Job suitability","Work motivation","Vitality","Irritability","Fatigue","Anxiety","Depression","Physical Symptoms","Support from supervisors","Support from colleagues","Support from family and friends","Satisfaction with work and life"]

{"sheet":"list","index":3,"n_rows":20,"n_cols":23,"rows_kept":20,"cut":false,"hidden":false,"merged":[[0,0,0,14],[1,15,1,16],[1,17,1,18],[1,19,1,20],[1,21,1,22],[0,15,0,22],[1,0,1,1],[1,4,1,6],[1,7,1,10],[1,11,1,14],[1,2,1,3]]}
["Basic Information",null,null,null,null,null,null,null,null,null,null,null,null,null,null,"設問回答欄"]
["①",null,"②",null,"③",null,null,"④",null,null,null,"⑤",null,null,null,"No.1~17,No.58~80",null,"No.18~46",null,"No.56~57",null,"No.47~55,No.81~109"]
[1,"Philippines",1,"Male",1,"Under 20 years old",null,1,"① General cargo ship",null,null,1,"①Captain",null,null,"Very much so","そうだ","Almost never","ほとんどなかった","Satisfied","満足","Extremely","非常に"]
[2,"India",2,"Female",2,"20-24 years old",null,2,"② Oil tanker",null,null,2,"②Chief Officer",null,null,"Moderately so","まあそうだ","Sometime","ときどきあった","Somewhat satisfied","まあ満足","Very much","かなり"]
[3,"Indonesia",null,null,3,"25-29 years old",null,3,"③ LNG tanker",null,null,3,"③Second Officer",null,null,"Somewhat","ややちがう","Often","しばしばあった","Somewhat dissatisfied","やや不満足","Somewhat","多少"]
[4,"Bangladesh",null,null,4,"30-34 years old",null,4,"④ Container ship ",null,null,4,"④Third Officer",null,null,"Not at all","ちがう","Almost always","ほんどいつもあった","Dissatisfied","不満足","Not at all","全くない"]
[5,"Others",null,null,5,"35-39 years old",null,5,"⑤ Car carrier",null,null,5,"⑤Chief Engineer"]
[null,null,null,null,6,"40-44 years old",null,6,"⑥ Ore/coal carrier",null,null,6,"⑥First Engineer "]
[null,null,null,null,7,"45-49 years old",null,7,"⑦ Chemical tanker",null,null,7,"⑦Second Engineer "]
[null,null,null,null,8,"50-54 years old",null,8,"⑧ Cement/limestone carrier ",null,null,8,"⑧Third Engineer"]
[null,null,null,null,9,"55 years old and above",null,9,"⑨ Sand/gravel carrier ",null,null,9,"⑨Purser"]
[null,null,null,null,null,null,null,10,"⑩ Passenger ship",null,null,10,"⑩Clerk"]
[null,null,null,null,null,null,null,11,"⑪ Ferry/RO-RO ship",null,null,11,"⑪Bosun"]
[null,null,null,null,null,null,null,12,"⑫ Dredger/work vessel",null,null,12,"⑫Deck Crew (Deckhand, Deckman, etc.) "]
[null,null,null,null,null,null,null,13,"⑬Training Ship",null,null,13,"⑬Chief Mate"]
[null,null,null,null,null,null,null,14,"⑭ Barge",null,null,14,"⑭Engine Crew (Enginehand, Engineman) "]
[null,null,null,null,null,null,null,15,"⑮ Tugboat",null,null,15,"⑮Chief Cook "]
[null,null,null,null,null,null,null,16,"⑯ Other",null,null,16,"⑯Cook Crew (Cookhand, Cookman)"]
[null,null,null,null,null,null,null,null,null,null,null,17,"⑰Chief Radio Officer"]
[null,null,null,null,null,null,null,null,null,null,null,18,"⑱Radio Operator"]